SnCl4..Cl anion

Reaction thermochemistry data

Data compiled by: John E. Bartmess

Individual Reactions

Chlorine anion + Tin(IV) chloride = Cl5Sn-

By formula: Cl- + Cl4Sn = Cl5Sn-

Quantity Value Units Method Reference Comment
Δr56.2 ± 1.9kcal/molCIDTHao, Kaspar, et al., 2005gas phase

References

Hao, Kaspar, et al., 2005
Hao, C.T.; Kaspar, J.D.; Check, C.E.; Lobring, K.C.; Gilbert, T.M.; Sunderlin, L.S., Effect of substituents on the strength of A-Cl- (A = Si, Ge, and Sn) bonds in hypervalent systems: ACl(5)(-), ACl(4)F(-), and A(CH3)(3)Cl-2(-), J. Phys. Chem. A, 2005, 109, 9, 2026-2034, https://doi.org/10.1021/jp040743x . [all data]