FSiCl3..Cl anion

Gas phase thermochemistry data

Data compiled by: John E. Bartmess

Quantity Value Units Method Reference Comment
Δfgas-295.82kcal/molTherHao, Kaspar, et al., 2005

Reaction thermochemistry data

Data compiled by: John E. Bartmess

Individual Reactions

Chlorine anion + Trichlorofluorosilane = Cl4FSi-

By formula: Cl- + Cl3FSi = Cl4FSi-

Quantity Value Units Method Reference Comment
Δr27.5 ± 1.7kcal/molCIDTHao, Kaspar, et al., 2005gas phase

References

Hao, Kaspar, et al., 2005
Hao, C.T.; Kaspar, J.D.; Check, C.E.; Lobring, K.C.; Gilbert, T.M.; Sunderlin, L.S., Effect of substituents on the strength of A-Cl- (A = Si, Ge, and Sn) bonds in hypervalent systems: ACl(5)(-), ACl(4)F(-), and A(CH3)(3)Cl-2(-), J. Phys. Chem. A, 2005, 109, 9, 2026-2034, https://doi.org/10.1021/jp040743x . [all data]