nPrS anion

Reaction thermochemistry data

Data compiled by: John E. Bartmess

Individual Reactions

C3H7S- + Hydrogen cation = Propyl mercaptan

By formula: C3H7S- + H+ = C3H8S

Quantity Value Units Method Reference Comment
Δr354.2 ± 2.2kcal/molG+TSBartmess, Scott, et al., 1979gas phase; value altered from reference due to change in acidity scale
Quantity Value Units Method Reference Comment
Δr347.9 ± 2.0kcal/molIMREBartmess, Scott, et al., 1979gas phase; value altered from reference due to change in acidity scale

References

Bartmess, Scott, et al., 1979
Bartmess, J.E.; Scott, J.A.; McIver, R.T., Jr., The gas phase acidity scale from methanol to phenol, J. Am. Chem. Soc., 1979, 101, 6047. [all data]