EtOD..F anion

Reaction thermochemistry data

Data compiled by: John E. Bartmess

Individual Reactions

Fluorine anion + Ethanol = C2H5D6FO-

By formula: F- + C2H6O = C2H5D6FO-

Quantity Value Units Method Reference Comment
Δr99.2 ± 8.4kJ/molIMREWilkinson, Szulejko, et al., 1992gas phase; Reported relative to ROH..F-, 0.5 kcal/mol weaker.

Ion clustering data

Data compiled by: John E. Bartmess

Clustering reactions

Fluorine anion + Ethanol = C2H5D6FO-

By formula: F- + C2H6O = C2H5D6FO-

Quantity Value Units Method Reference Comment
Δr23.7 ± 2.0kcal/molIMREWilkinson, Szulejko, et al., 1992gas phase; Reported relative to ROH..F-, 0.5 kcal/mol weaker.

References

Wilkinson, Szulejko, et al., 1992
Wilkinson, F.E.; Szulejko, J.E.; Allison, C.E.; Mcmahon, T.B., Fourier Transform Ion Cyclotron Resonance Investigation of the Deuterium Isotope Effect on Gas Phase Ion/Molecule Hydrogen Bonding Interactions in Alcohol-Fluoride Adduct Ions, Int. J. Mass Spectrom., 1992, 117, 487-505, https://doi.org/10.1016/0168-1176(92)80110-M . [all data]