indan-1,3-dione-2-CONHPh-2-ide anion

Reaction thermochemistry data

Data compiled by: John E. Bartmess

Individual Reactions

C16H10NO3- + Hydrogen cation = C16H11NO3

By formula: C16H10NO3- + H+ = C16H11NO3

Quantity Value Units Method Reference Comment
Δr321.2 ± 2.1kcal/molG+TSMishima, Matsuoka, et al., 2004gas phase; Calc: enol form of acid more stable.
Quantity Value Units Method Reference Comment
Δr313.3 ± 2.0kcal/molIMREMishima, Matsuoka, et al., 2004gas phase; Calc: enol form of acid more stable.

References

Mishima, Matsuoka, et al., 2004
Mishima, M.; Matsuoka, M.; Lei, Y.X.; Rappoport, Z., Gas-phase acidities of disubstituted methanes and of enols of carboxamides substituted by electron-withdrawing groups, J. Org. Chem., 2004, 69, 18, 5947-5965, https://doi.org/10.1021/jo040196b . [all data]