indan-1,3-dione-2-ide anion

Gas phase ion energetics data

Data compiled by: John E. Bartmess

Protonation reactions

C9H5O2- + Hydrogen cation = 1H-Indene-1,3(2H)-dione

By formula: C9H5O2- + H+ = C9H6O2

Quantity Value Units Method Reference Comment
Δr1400. ± 8.8kJ/molG+TSMishima, Matsuoka, et al., 2004gas phase; Calc: keto form of acid more stable.
Quantity Value Units Method Reference Comment
Δr1372. ± 8.4kJ/molIMREMishima, Matsuoka, et al., 2004gas phase; Calc: keto form of acid more stable.

References

Mishima, Matsuoka, et al., 2004
Mishima, M.; Matsuoka, M.; Lei, Y.X.; Rappoport, Z., Gas-phase acidities of disubstituted methanes and of enols of carboxamides substituted by electron-withdrawing groups, J. Org. Chem., 2004, 69, 18, 5947-5965, https://doi.org/10.1021/jo040196b . [all data]