cyclopentane-1,3-dione-2-ide anion

Reaction thermochemistry data

Data compiled by: John E. Bartmess

Individual Reactions

C5H5O2- + Hydrogen cation = 1,3-Cyclopentanedione

By formula: C5H5O2- + H+ = C5H6O2

Quantity Value Units Method Reference Comment
Δr333.5 ± 2.1kcal/molG+TSMishima, Matsuoka, et al., 2004gas phase; Calc: keto form of acid more stable.
Quantity Value Units Method Reference Comment
Δr326.5 ± 2.0kcal/molIMREMishima, Matsuoka, et al., 2004gas phase; Calc: keto form of acid more stable.

References

Mishima, Matsuoka, et al., 2004
Mishima, M.; Matsuoka, M.; Lei, Y.X.; Rappoport, Z., Gas-phase acidities of disubstituted methanes and of enols of carboxamides substituted by electron-withdrawing groups, J. Org. Chem., 2004, 69, 18, 5947-5965, https://doi.org/10.1021/jo040196b . [all data]