iPrNHCOC(CN)2 anion

Reaction thermochemistry data

Data compiled by: John E. Bartmess

Individual Reactions

C7H8N3O- + Hydrogen cation = C7H9N3O

By formula: C7H8N3O- + H+ = C7H9N3O

Quantity Value Units Method Reference Comment
Δr1323. ± 8.8kJ/molG+TSMishima, Matsuoka, et al., 2004gas phase; Calc: enol form of acid more stable.
Quantity Value Units Method Reference Comment
Δr1294. ± 8.4kJ/molIMREMishima, Matsuoka, et al., 2004gas phase; Calc: enol form of acid more stable.

References

Mishima, Matsuoka, et al., 2004
Mishima, M.; Matsuoka, M.; Lei, Y.X.; Rappoport, Z., Gas-phase acidities of disubstituted methanes and of enols of carboxamides substituted by electron-withdrawing groups, J. Org. Chem., 2004, 69, 18, 5947-5965, https://doi.org/10.1021/jo040196b . [all data]