PhNHCOC(CN)2 anion

Reaction thermochemistry data

Data compiled by: John E. Bartmess

Individual Reactions

C10H6N3O- + Hydrogen cation = C10H7N3O

By formula: C10H6N3O- + H+ = C10H7N3O

Quantity Value Units Method Reference Comment
Δr1296. ± 8.8kJ/molG+TSMishima, Matsuoka, et al., 2004gas phase; Calc: keto form of acid more stable.
Quantity Value Units Method Reference Comment
Δr1268. ± 8.4kJ/molIMREMishima, Matsuoka, et al., 2004gas phase; Calc: keto form of acid more stable.

References

Mishima, Matsuoka, et al., 2004
Mishima, M.; Matsuoka, M.; Lei, Y.X.; Rappoport, Z., Gas-phase acidities of disubstituted methanes and of enols of carboxamides substituted by electron-withdrawing groups, J. Org. Chem., 2004, 69, 18, 5947-5965, https://doi.org/10.1021/jo040196b . [all data]