CH radical anion

Gas phase ion energetics data

Data compiled by: John E. Bartmess

Protonation reactions

CH- + Hydrogen cation = Methylene

By formula: CH- + H+ = CH2

Quantity Value Units Method Reference Comment
Δr386.05 ± 0.44kcal/molD-EAKasdan, Herbst, et al., 1975gas phase
Quantity Value Units Method Reference Comment
Δr379.29 ± 0.53kcal/molH-TSKasdan, Herbst, et al., 1975gas phase

References

Kasdan, Herbst, et al., 1975
Kasdan, A.; Herbst, E.; Lineberger, W.C., Laser photoelectron spectrometry of CH2-, Chem. Phys. Lett., 1975, 31, 78. [all data]