ReBr6 dianion

Gas phase ion energetics data

Data compiled by: John E. Bartmess

Electron affinity of neutral species

EAneutral (eV) Method Reference Comment
0.760 ± 0.060LPESWang and Wang, 1999

References

Wang and Wang, 1999
Wang, X.B.; Wang, L.S., Photodetachment of free hexahalogenometallate doubly charged anions in the gas phase: [ML6](2-), (M=Re, Os, Ir, Pt; L=Cl and Br), J. Chem. Phys., 1999, 111, 10, 4497-4509, https://doi.org/10.1063/1.479213 . [all data]