H2NS anion

Reaction thermochemistry data

Data compiled by: John E. Bartmess

Individual Reactions

H2NS- + Hydrogen cation = H3NS

By formula: H2NS- + H+ = H3NS

Quantity Value Units Method Reference Comment
Δr356.9 ± 3.1kcal/molG+TSDePuy and Bierbaum, 1981gas phase; Between CF3CH2OH and H2S, comparable to MeSH; value altered from reference due to change in acidity scale
Quantity Value Units Method Reference Comment
Δr350.6 ± 3.0kcal/molIMRBDePuy and Bierbaum, 1981gas phase; Between CF3CH2OH and H2S, comparable to MeSH; value altered from reference due to change in acidity scale
Δr353.7 ± 3.0kcal/molIMRBBierbaum, Grabowski, et al., 1984gas phase; NH2- + COS ->.

References

DePuy and Bierbaum, 1981
DePuy, C.H.; Bierbaum, V.M., Gas phase sulfur anions: Synthesis and reactions of H2NS- and related ions, Tetrahedron Lett., 1981, 22, 5129. [all data]

Bierbaum, Grabowski, et al., 1984
Bierbaum, V.M.; Grabowski, J.J.; DePuy, C.H., Gas-phase synthesis and reactions of nitrogen- and sulfur-containing anions, J. Phys. Chem., 1984, 88, 1389. [all data]