(MeOH){H2O}..Cl anion

Gas phase thermochemistry data

Data compiled by: John E. Bartmess

Quantity Value Units Method Reference Comment
Δfgas-188.27kcal/molTherEvans and Keesee, 1991For solvation by MeOH of core ion

References

Evans and Keesee, 1991
Evans, D.H.; Keesee, R.G., Thermodynamics of Gas-Phase Mixed-Solvent Cluster Ions - Water and Methanol on K+ and Cl- and Comparison to Liquid Solutions, J. Phys. Chem., 1991, 95, 9, 3558, https://doi.org/10.1021/j100162a024 . [all data]