(MeNO2)3..MeNO4 anion

Reaction thermochemistry data

Data compiled by: John E. Bartmess

Individual Reactions

C3H9N3O8- + 3Methane, nitro- = C4H12N4O10-

By formula: C3H9N3O8- + 3CH3NO2 = C4H12N4O10-

Quantity Value Units Method Reference Comment
Δr39.7 ± 3.8kJ/molTDAsWincel, 2003gas phase
Quantity Value Units Method Reference Comment
Δr9.62kJ/molTDAsWincel, 2003gas phase

C4H12N4O10- + 4Methane, nitro- = C5H15N5O12-

By formula: C4H12N4O10- + 4CH3NO2 = C5H15N5O12-

Quantity Value Units Method Reference Comment
Δr25.1kJ/molTDAsWincel, 2003gas phase
Quantity Value Units Method Reference Comment
Δr2.5kJ/molTDAsWincel, 2003gas phase

Ion clustering data

Data compiled by: John E. Bartmess

Clustering reactions

C3H9N3O8- + 3Methane, nitro- = C4H12N4O10-

By formula: C3H9N3O8- + 3CH3NO2 = C4H12N4O10-

Quantity Value Units Method Reference Comment
Δr9.50 ± 0.90kcal/molTDAsWincel, 2003gas phase
Quantity Value Units Method Reference Comment
Δr2.30kcal/molTDAsWincel, 2003gas phase

C4H12N4O10- + 4Methane, nitro- = C5H15N5O12-

By formula: C4H12N4O10- + 4CH3NO2 = C5H15N5O12-

Quantity Value Units Method Reference Comment
Δr6.00kcal/molTDAsWincel, 2003gas phase
Quantity Value Units Method Reference Comment
Δr0.60kcal/molTDAsWincel, 2003gas phase

References

Wincel, 2003
Wincel, H., Gas-phase Solvation of Cl-, NO2-, CH2NO2-, CH3NO2-, and CH3NO4- by CH3NO2, Int. J. Mass Spectrom., 2003, 226, 3, 341-353, https://doi.org/10.1016/S1387-3806(03)00066-6 . [all data]