(MeNO2)4..CH2NO2 anion

Reaction thermochemistry data

Data compiled by: John E. Bartmess

Individual Reactions

C4H11N4O8- + 4Methane, nitro- = C5H14N5O10-

By formula: C4H11N4O8- + 4CH3NO2 = C5H14N5O10-

Quantity Value Units Method Reference Comment
Δr47.70 ± 0.84kJ/molTDAsWincel, 2003gas phase
Quantity Value Units Method Reference Comment
Δr6.69kJ/molTDAsWincel, 2003gas phase

Ion clustering data

Data compiled by: John E. Bartmess

Clustering reactions

C4H11N4O8- + 4Methane, nitro- = C5H14N5O10-

By formula: C4H11N4O8- + 4CH3NO2 = C5H14N5O10-

Quantity Value Units Method Reference Comment
Δr47.70 ± 0.84kJ/molTDAsWincel, 2003gas phase
Quantity Value Units Method Reference Comment
Δr6.69kJ/molTDAsWincel, 2003gas phase

References

Wincel, 2003
Wincel, H., Gas-phase Solvation of Cl-, NO2-, CH2NO2-, CH3NO2-, and CH3NO4- by CH3NO2, Int. J. Mass Spectrom., 2003, 226, 3, 341-353, https://doi.org/10.1016/S1387-3806(03)00066-6 . [all data]