MeNO2..CH2NO2 anion

Reaction thermochemistry data

Data compiled by: John E. Bartmess

Individual Reactions

CH2NO2- + Methane, nitro- = C2H5N2O4-

By formula: CH2NO2- + CH3NO2 = C2H5N2O4-

Quantity Value Units Method Reference Comment
Δr66.5 ± 2.1kJ/molTDAsWincel, 2003gas phase
Quantity Value Units Method Reference Comment
Δr35.1kJ/molTDAsWincel, 2003gas phase

C2H5N2O4- + 2Methane, nitro- = C3H8N3O6-

By formula: C2H5N2O4- + 2CH3NO2 = C3H8N3O6-

Quantity Value Units Method Reference Comment
Δr55.6 ± 2.9kJ/molTDAsWincel, 2003gas phase
Quantity Value Units Method Reference Comment
Δr24.3kJ/molTDAsWincel, 2003gas phase

References

Wincel, 2003
Wincel, H., Gas-phase Solvation of Cl-, NO2-, CH2NO2-, CH3NO2-, and CH3NO4- by CH3NO2, Int. J. Mass Spectrom., 2003, 226, 3, 341-353, https://doi.org/10.1016/S1387-3806(03)00066-6 . [all data]