(MeNO2)3..Cl anion

Gas phase thermochemistry data

Data compiled by: John E. Bartmess

Quantity Value Units Method Reference Comment
Δfgas-620.95kJ/molTherWincel, 2003

Reaction thermochemistry data

Data compiled by: John E. Bartmess

Individual Reactions

C2H6ClN2O4- + 3Methane, nitro- = C3H9ClN3O6-

By formula: C2H6ClN2O4- + 3CH3NO2 = C3H9ClN3O6-

Quantity Value Units Method Reference Comment
Δr46.4 ± 2.1kJ/molN/AWincel, 2003gas phase
Quantity Value Units Method Reference Comment
Δr15.5kJ/molTDAsWincel, 2003gas phase

C3H9ClN3O6- + 4Methane, nitro- = C4H12ClN4O8-

By formula: C3H9ClN3O6- + 4CH3NO2 = C4H12ClN4O8-

Quantity Value Units Method Reference Comment
Δr40. ± 4.2kJ/molN/AWincel, 2003gas phase
Quantity Value Units Method Reference Comment
Δr11.3kJ/molTDAsWincel, 2003gas phase

Ion clustering data

Data compiled by: John E. Bartmess

Clustering reactions

C2H6ClN2O4- + 3Methane, nitro- = C3H9ClN3O6-

By formula: C2H6ClN2O4- + 3CH3NO2 = C3H9ClN3O6-

Quantity Value Units Method Reference Comment
Δr46.4 ± 2.1kJ/molN/AWincel, 2003gas phase
Quantity Value Units Method Reference Comment
Δr15.5kJ/molTDAsWincel, 2003gas phase

C3H9ClN3O6- + 4Methane, nitro- = C4H12ClN4O8-

By formula: C3H9ClN3O6- + 4CH3NO2 = C4H12ClN4O8-

Quantity Value Units Method Reference Comment
Δr40. ± 4.2kJ/molN/AWincel, 2003gas phase
Quantity Value Units Method Reference Comment
Δr11.3kJ/molTDAsWincel, 2003gas phase

References

Wincel, 2003
Wincel, H., Gas-phase Solvation of Cl-, NO2-, CH2NO2-, CH3NO2-, and CH3NO4- by CH3NO2, Int. J. Mass Spectrom., 2003, 226, 3, 341-353, https://doi.org/10.1016/S1387-3806(03)00066-6 . [all data]