(EtNO2)4..EtNO4 anion

Reaction thermochemistry data

Data compiled by: John E. Bartmess

Individual Reactions

C8H20N4O10- + 4Ethane, nitro- = C10H25N5O12-

By formula: C8H20N4O10- + 4C2H5NO2 = C10H25N5O12-

Quantity Value Units Method Reference Comment
Δr10.50 ± 0.50kcal/molTDAsWincel, 2004gas phase
Quantity Value Units Method Reference Comment
Δr0.70kcal/molTDAsWincel, 2004gas phase

Ion clustering data

Data compiled by: John E. Bartmess

Clustering reactions

C8H20N4O10- + 4Ethane, nitro- = C10H25N5O12-

By formula: C8H20N4O10- + 4C2H5NO2 = C10H25N5O12-

Quantity Value Units Method Reference Comment
Δr10.50 ± 0.50kcal/molTDAsWincel, 2004gas phase
Quantity Value Units Method Reference Comment
Δr0.70kcal/molTDAsWincel, 2004gas phase

References

Wincel, 2004
Wincel, H., Gas-phase clustering reactions of NO2-, C2H3NO2-, C2H4NO2-C2H5NO2- and C2H5NO4- with C2H5NO2, Int. J. Mass Spectrom., 2004, 232, 2, 185-194, https://doi.org/10.1016/j.ijms.2004.01.003 . [all data]