(EtNO2)3..EtNO4 anion

Reaction thermochemistry data

Data compiled by: John E. Bartmess

Individual Reactions

C6H15N3O8- + 3Ethane, nitro- = C8H20N4O10-

By formula: C6H15N3O8- + 3C2H5NO2 = C8H20N4O10-

Quantity Value Units Method Reference Comment
Δr47.3 ± 2.1kJ/molTDAsWincel, 2004gas phase
Quantity Value Units Method Reference Comment
Δr10.0kJ/molTDAsWincel, 2004gas phase

C8H20N4O10- + 4Ethane, nitro- = C10H25N5O12-

By formula: C8H20N4O10- + 4C2H5NO2 = C10H25N5O12-

Quantity Value Units Method Reference Comment
Δr43.9 ± 2.1kJ/molTDAsWincel, 2004gas phase
Quantity Value Units Method Reference Comment
Δr2.9kJ/molTDAsWincel, 2004gas phase

References

Wincel, 2004
Wincel, H., Gas-phase clustering reactions of NO2-, C2H3NO2-, C2H4NO2-C2H5NO2- and C2H5NO4- with C2H5NO2, Int. J. Mass Spectrom., 2004, 232, 2, 185-194, https://doi.org/10.1016/j.ijms.2004.01.003 . [all data]