(EtNO2)4..EtNO2 anion
- Formula: C10H25N5O10-
- Molecular weight: 375.3335

Reaction thermochemistry data

Data compiled by: John E. Bartmess
Individual Reactions
C8H20N4O8- + 4 = C10H25N5O10-
By formula: C8H20N4O8- + 4C2H5NO2 = C10H25N5O10-
Quantity | Value | Units | Method | Reference | Comment |
---|---|---|---|---|---|
ΔrH° | 49.8 ± 2.1 | kJ/mol | TDAs | Wincel, 2004 | gas phase |
Quantity | Value | Units | Method | Reference | Comment |
ΔrG° | 8.79 | kJ/mol | TDAs | Wincel, 2004 | gas phase |

Gas phase ion energetics data

Data compiled by: John E. Bartmess
Electron affinity of neutral species
EAneutral (eV) | Method | Reference | Comment |
---|---|---|---|
2.10 ± 0.40 | LPES | Stokes, Bowen, et al., 2008 |

Ion clustering data

Data compiled by: John E. Bartmess

Clustering reactions

C8H20N4O8- + 4Ethane, nitro- = C10H25N5O10-

By formula: C8H20N4O8- + 4C2H5NO2 = C10H25N5O10-

Quantity Value Units Method Reference Comment
Δr49.8 ± 2.1kJ/molTDAsWincel, 2004gas phase
Quantity Value Units Method Reference Comment
Δr8.79kJ/molTDAsWincel, 2004gas phase

References

Wincel, 2004
Wincel, H.,
Gas-phase clustering reactions of NO2-, C2H3NO2-, C2H4NO2-C2H5NO2- and C2H5NO4- with C2H5NO2,
Int. J. Mass Spectrom., 2004, 232, 2, 185-194, https://doi.org/10.1016/j.ijms.2004.01.003
. [all data]
Stokes, Bowen, et al., 2008
Stokes, S.T.; Bowen, K.H.; Sommerfeld, T.; Ard, S.; Mirsaleh-Kohan, N.; Steill, J.D.; Compton, R.N.,
Negative ions of nitroethane and its clusters,
J. Chem. Phys., 2008, 129, 6, 064308, https://doi.org/10.1063/1.2965534
. [all data]