(EtNO2)3..EtNO2 anion

Gas phase ion energetics data

Data compiled by: John E. Bartmess

Electron affinity of neutral species

EAneutral (eV) Method Reference Comment
1.90 ± 0.20LPESStokes, Bowen, et al., 2008Vertical Detachment Energy: 2.3±0.1 eV

References

Stokes, Bowen, et al., 2008
Stokes, S.T.; Bowen, K.H.; Sommerfeld, T.; Ard, S.; Mirsaleh-Kohan, N.; Steill, J.D.; Compton, R.N., Negative ions of nitroethane and its clusters, J. Chem. Phys., 2008, 129, 6, 064308, https://doi.org/10.1063/1.2965534 . [all data]