(EtNO2)2..EtNO2 anion

Reaction thermochemistry data

Data compiled by: John E. Bartmess

Individual Reactions

CAS Reg. No. 34533-65-8 + 2Ethane, nitro- = C6H15N3O6-

By formula: CAS Reg. No. 34533-65-8 + 2C2H5NO2 = C6H15N3O6-

Quantity Value Units Method Reference Comment
Δr61.09 ± 0.84kJ/molTDAsWincel, 2004gas phase
Quantity Value Units Method Reference Comment
Δr26.4kJ/molTDAsWincel, 2004gas phase

C6H15N3O6- + 3Ethane, nitro- = C8H20N4O8-

By formula: C6H15N3O6- + 3C2H5NO2 = C8H20N4O8-

Quantity Value Units Method Reference Comment
Δr56.9 ± 1.3kJ/molTDAsWincel, 2004gas phase
Quantity Value Units Method Reference Comment
Δr19.7kJ/molTDAsWincel, 2004gas phase

Gas phase ion energetics data

Data compiled by: John E. Bartmess

Electron affinity of neutral species

EAneutral (eV) Method Reference Comment
1.50 ± 0.20LPESStokes, Bowen, et al., 2008Vertical Detachment Energy: 2.04±0.1 eV

Ion clustering data

Data compiled by: John E. Bartmess

Clustering reactions

C6H15N3O6- + 3Ethane, nitro- = C8H20N4O8-

By formula: C6H15N3O6- + 3C2H5NO2 = C8H20N4O8-

Quantity Value Units Method Reference Comment
Δr56.9 ± 1.3kJ/molTDAsWincel, 2004gas phase
Quantity Value Units Method Reference Comment
Δr19.7kJ/molTDAsWincel, 2004gas phase

References

Wincel, 2004
Wincel, H., Gas-phase clustering reactions of NO2-, C2H3NO2-, C2H4NO2-C2H5NO2- and C2H5NO4- with C2H5NO2, Int. J. Mass Spectrom., 2004, 232, 2, 185-194, https://doi.org/10.1016/j.ijms.2004.01.003 . [all data]

Stokes, Bowen, et al., 2008
Stokes, S.T.; Bowen, K.H.; Sommerfeld, T.; Ard, S.; Mirsaleh-Kohan, N.; Steill, J.D.; Compton, R.N., Negative ions of nitroethane and its clusters, J. Chem. Phys., 2008, 129, 6, 064308, https://doi.org/10.1063/1.2965534 . [all data]