1,3-O2C-C6H4-CO2 dianion

Gas phase ion energetics data

Data compiled by: John E. Bartmess

Electron affinity of neutral species

EAneutral (eV) Method Reference Comment
0.210 ± 0.050LPESYang, Fu, et al., 2004
0.85 ± 0.10LPESWang, Nicholas, et al., 2000Vertical Detachment Energy: 1.08±0.10 eV

Protonation reactions

C8H4O4-2 + Hydrogen cation = C8H5O4-2

By formula: C8H4O4-2 + H+ = C8H5O4-2

Quantity Value Units Method Reference Comment
Δr421.8 ± 3.2kcal/molD-EAYang, Fu, et al., 2004gas phase

References

Yang, Fu, et al., 2004
Yang, X.; Fu, Y.J.; Wang, X.B.; Slavicek, P.; Mucha, M.; Jungwirth, P.; Wang, L.S., Solvent-mediated folding of a doubly charged anion, J. Am. Chem. Soc., 2004, 126, 3, 876-883, https://doi.org/10.1021/ja038108c . [all data]

Wang, Nicholas, et al., 2000
Wang, X.B.; Nicholas, J.B.; Wang, L.S., Intramolecular Coulomb repulsion and anisotropies of the repulsive Coulomb barrier in multiply charged anions, J. Chem. Phys., 2000, 113, 2, 653-661, https://doi.org/10.1063/1.481842 . [all data]