(H2O)20..O2C(CH2)6CO2 dianion

Gas phase ion energetics data

Data compiled by: John E. Bartmess

Electron affinity of neutral species

EAneutral (eV) Method Reference Comment
4.50 ± 0.10LPESYang, Fu, et al., 2004Vertical Detachment Energy: 5.2±0.2

References

Yang, Fu, et al., 2004
Yang, X.; Fu, Y.J.; Wang, X.B.; Slavicek, P.; Mucha, M.; Jungwirth, P.; Wang, L.S., Solvent-mediated folding of a doubly charged anion, J. Am. Chem. Soc., 2004, 126, 3, 876-883, https://doi.org/10.1021/ja038108c . [all data]