nBuCH=C(Me)O anion

Gas phase ion energetics data

Data compiled by: John E. Bartmess

Protonation reactions

C7H13O- + Hydrogen cation = 2-Heptanone

By formula: C7H13O- + H+ = C7H14O

Quantity Value Units Method Reference Comment
Δr1528. ± 8.8kJ/molTDEqBurkell, Fridgen, et al., 2003gas phase
Quantity Value Units Method Reference Comment
Δr1498. ± 8.8kJ/molTDEqBurkell, Fridgen, et al., 2003gas phase

References

Burkell, Fridgen, et al., 2003
Burkell, J.L.; Fridgen, T.D.; McMahon, T.B., Gas-phase acidities and sites of deprotonation of 2-ketones and structures of the corresponding enolates, Int. J. Mass Spectrom., 2003, 227, 3, 497-508, https://doi.org/10.1016/S1387-3806(03)00102-7 . [all data]