nPrCH=C(Me)O anion

Reaction thermochemistry data

Data compiled by: John E. Bartmess

Individual Reactions

C6H11O- + Hydrogen cation = 2-Hexanone

By formula: C6H11O- + H+ = C6H12O

Quantity Value Units Method Reference Comment
Δr1531. ± 8.8kJ/molTDEqBurkell, Fridgen, et al., 2003gas phase
Quantity Value Units Method Reference Comment
Δr1501. ± 8.4kJ/molTDEqBurkell, Fridgen, et al., 2003gas phase

Gas phase ion energetics data

Data compiled by: John E. Bartmess

Protonation reactions

C6H11O- + Hydrogen cation = 2-Hexanone

By formula: C6H11O- + H+ = C6H12O

Quantity Value Units Method Reference Comment
Δr1531. ± 8.8kJ/molTDEqBurkell, Fridgen, et al., 2003gas phase
Quantity Value Units Method Reference Comment
Δr1501. ± 8.4kJ/molTDEqBurkell, Fridgen, et al., 2003gas phase

References

Burkell, Fridgen, et al., 2003
Burkell, J.L.; Fridgen, T.D.; McMahon, T.B., Gas-phase acidities and sites of deprotonation of 2-ketones and structures of the corresponding enolates, Int. J. Mass Spectrom., 2003, 227, 3, 497-508, https://doi.org/10.1016/S1387-3806(03)00102-7 . [all data]