(NH3)14..Na anion

Gas phase ion energetics data

Data compiled by: John E. Bartmess

Electron affinity of neutral species

EAneutral (eV) Method Reference Comment
0.69 ± 0.10LPESTakasu, Misaizu, et al., 1997Stated electron affinity is the Vertical Detachment Energy

References

Takasu, Misaizu, et al., 1997
Takasu, R.; Misaizu, F.; Hashimoto, K.; Fuke, K., Microscopic Solvation Process of Alkali Atoms in Finite Clusters: Photoelectron and Photoionization Studies of M(H2O)n and M(NH3)n(M= Li, Li-, Na-), J. Phys. Chem. A, 1997, 101, 17, 3078, https://doi.org/10.1021/jp9629654 . [all data]