tBuCH=NO anion

Gas phase ion energetics data

Data compiled by: John E. Bartmess

Electron affinity of neutral species

EAneutral (eV) Method Reference Comment
1.51 ± 0.17D-EABartmess, Scott, et al., 1979value altered from reference due to change in acidity scale

Protonation reactions

C5H10NO- + Hydrogen cation = Propanal, 2,2-dimethyl-, oxime

By formula: C5H10NO- + H+ = C5H11NO

Quantity Value Units Method Reference Comment
Δr1518. ± 11.kJ/molG+TSBartmess, Scott, et al., 1979gas phase; value altered from reference due to change in acidity scale
Quantity Value Units Method Reference Comment
Δr1489. ± 10.kJ/molIMREBartmess, Scott, et al., 1979gas phase; value altered from reference due to change in acidity scale

Reaction thermochemistry data

Data compiled by: John E. Bartmess

Individual Reactions

C5H10NO- + Hydrogen cation = Propanal, 2,2-dimethyl-, oxime

By formula: C5H10NO- + H+ = C5H11NO

Quantity Value Units Method Reference Comment
Δr1518. ± 11.kJ/molG+TSBartmess, Scott, et al., 1979gas phase; value altered from reference due to change in acidity scale
Quantity Value Units Method Reference Comment
Δr1489. ± 10.kJ/molIMREBartmess, Scott, et al., 1979gas phase; value altered from reference due to change in acidity scale

References

Bartmess, Scott, et al., 1979
Bartmess, J.E.; Scott, J.A.; McIver, R.T., Jr., The gas phase acidity scale from methanol to phenol, J. Am. Chem. Soc., 1979, 101, 6047. [all data]