(H2O)30..O2CCO2 dianion

Gas phase ion energetics data

Data compiled by: John E. Bartmess

Electron affinity of neutral species

EAneutral (eV) Method Reference Comment
4.40 ± 0.10LPESWang, Yang, et al., 2003

References

Wang, Yang, et al., 2003
Wang, X.B.; Yang, X.; Nicholas, J.B.; Wang, L.S., Photodetachment of hydrated oxalate dianions in the gas phase, C2O42-(H2O)(n) (n=3-40): From solvated clusters to nanodroplet, J. Chem. Phys., 2003, 119, 7, 3631-3640, https://doi.org/10.1063/1.1590641 . [all data]