Me2C=NO anion

Reaction thermochemistry data

Data compiled by: John E. Bartmess

Individual Reactions

C3H6NO- + Hydrogen cation = 2-Propanone, oxime

By formula: C3H6NO- + H+ = C3H7NO

Quantity Value Units Method Reference Comment
Δr1531. ± 9.2kJ/molG+TSBartmess, Scott, et al., 1979gas phase; value altered from reference due to change in acidity scale
Quantity Value Units Method Reference Comment
Δr1502. ± 8.4kJ/molIMREBartmess, Scott, et al., 1979gas phase; value altered from reference due to change in acidity scale

Gas phase ion energetics data

Data compiled by: John E. Bartmess

Electron affinity of neutral species

EAneutral (eV) Method Reference Comment
1.40 ± 0.13D-EABartmess, Scott, et al., 1979value altered from reference due to change in acidity scale

Protonation reactions

C3H6NO- + Hydrogen cation = 2-Propanone, oxime

By formula: C3H6NO- + H+ = C3H7NO

Quantity Value Units Method Reference Comment
Δr1531. ± 9.2kJ/molG+TSBartmess, Scott, et al., 1979gas phase; value altered from reference due to change in acidity scale
Quantity Value Units Method Reference Comment
Δr1502. ± 8.4kJ/molIMREBartmess, Scott, et al., 1979gas phase; value altered from reference due to change in acidity scale

References

Bartmess, Scott, et al., 1979
Bartmess, J.E.; Scott, J.A.; McIver, R.T., Jr., The gas phase acidity scale from methanol to phenol, J. Am. Chem. Soc., 1979, 101, 6047. [all data]