b-naphthaleno-cyclopropenide anion

Gas phase ion energetics data

Data compiled by: John E. Bartmess

Protonation reactions

C11H7- + Hydrogen cation = 1H-Cyclopropa[b]naphthalene

By formula: C11H7- + H+ = C11H8

Quantity Value Units Method Reference Comment
Δr1527. ± 9.2kJ/molG+TSAntol, Glasovac, et al., 2003gas phase
Quantity Value Units Method Reference Comment
Δr1496. ± 8.8kJ/molIMREAntol, Glasovac, et al., 2003gas phase

Reaction thermochemistry data

Data compiled by: John E. Bartmess

Individual Reactions

C11H7- + Hydrogen cation = 1H-Cyclopropa[b]naphthalene

By formula: C11H7- + H+ = C11H8

Quantity Value Units Method Reference Comment
Δr1527. ± 9.2kJ/molG+TSAntol, Glasovac, et al., 2003gas phase
Quantity Value Units Method Reference Comment
Δr1496. ± 8.8kJ/molIMREAntol, Glasovac, et al., 2003gas phase

References

Antol, Glasovac, et al., 2003
Antol, I.; Glasovac, Z.; Hare, M.C.; Eckert-Maksic, M.; Kass, S.R., On the acidity of cyclopropanaphthalenes - Gas phase and computational studies, Int. J. Mass Spectrom., 2003, 222, 1-3, 11-26, https://doi.org/10.1016/S1387-3806(02)00953-3 . [all data]