cyclopentoxide anion

Reaction thermochemistry data

Data compiled by: John E. Bartmess

Individual Reactions

C5H9O- + Hydrogen cation = Cyclopentanol

By formula: C5H9O- + H+ = C5H10O

Quantity Value Units Method Reference Comment
Δr1602. ± 19.kJ/molD-EAAlconcel and Continetti, 2002gas phase; derived acidity seems ca. 10 kcal/mol too weak, and EA likewise
Quantity Value Units Method Reference Comment
Δr1535. ± 4.6kJ/molN/AGarver, Yang, et al., 2011gas phase
Δr1569. ± 20.kJ/molH-TSAlconcel and Continetti, 2002gas phase; derived acidity seems ca. 10 kcal/mol too weak, and EA likewise

References

Alconcel and Continetti, 2002
Alconcel, L.S.; Continetti, R.E., Dissociation dynamics and stability of cyclopentoxy and cyclopentoxide, Chem. Phys. Lett., 2002, 366, 5-6, 642-649, https://doi.org/10.1016/S0009-2614(02)01633-0 . [all data]

Garver, Yang, et al., 2011
Garver, J.M.; Yang, Z.B.; Kato, S.; Wren, S.W.; Vogelhuber, K.M.; Lineberger, W.C.; Bierbaum, V.M., Gas Phase Reactions of 1,3,5-Triazine: Proton Transfer, Hydride Transfer, and Anionic sigma-Adduct Formation, J. Am. Soc. Mass Spectrom., 2011, 22, 7, 1260-1272, https://doi.org/10.1007/s13361-011-0133-9 . [all data]