3,5-diCF3-phenoxide anion

Gas phase ion energetics data

Data compiled by: John E. Bartmess

Electron affinity of neutral species

EAneutral (eV) Method Reference Comment
3.42 ± 0.20D-EATaft and Topsom, 1987

Protonation reactions

C8H3F6O- + Hydrogen cation = 3,5-Bis(trifluoromethyl)phenol

By formula: C8H3F6O- + H+ = C8H4F6O

Quantity Value Units Method Reference Comment
Δr329.7 ± 2.1kcal/molG+TSTaft and Topsom, 1987gas phase
Quantity Value Units Method Reference Comment
Δr322.9 ± 2.0kcal/molIMRETaft and Topsom, 1987gas phase

References

Taft and Topsom, 1987
Taft, R.W.; Topsom, R.D., The Nature and Analysis of Substituent Effects, Prog. Phys. Org. Chem., 1987, 16, 1. [all data]