B6 anion

Gas phase ion energetics data

Data compiled by: John E. Bartmess

Electron affinity of neutral species

EAneutral (eV) Method Reference Comment
3.010 ± 0.040LPESAlexandrova, Boldyrev, et al., 2003

References

Alexandrova, Boldyrev, et al., 2003
Alexandrova, A.N.; Boldyrev, A.I.; Zhai, H.J.; Wang, L.S.; Steiner, E.; Fowler, P.W., Structure and bonding in B6(-) and B6: Planarity and antiaromaticity, J. Phys. Chem. A, 2003, 107, 9, 1359-1369, https://doi.org/10.1021/jp0268866 . [all data]