Ni26 radical anion

Gas phase ion energetics data

Data compiled by: John E. Bartmess

Electron affinity of neutral species

EAneutral (eV) Method Reference Comment
2.730 ± 0.050LPESLiu, Zhai, et al., 2002

References

Liu, Zhai, et al., 2002
Liu, S.R.; Zhai, H.J.; Wang, L.S., Evolution of the electronic properties of small Ni-n(-) (n=1- 100) clusters by photoelectron spectroscopy, J. Chem. Phys., 2002, 117, 21, 9758-9765, https://doi.org/10.1063/1.1519008 . [all data]