pentafluorophenoxide anion

Reaction thermochemistry data

Data compiled by: John E. Bartmess

Individual Reactions

C6F5O- + Hydrogen cation = Phenol, pentafluoro-

By formula: C6F5O- + H+ = C6HF5O

Quantity Value Units Method Reference Comment
Δr328.0 ± 2.2kcal/molG+TSKoppel, Taft, et al., 1994gas phase
Δr<389.5 ± 2.7kcal/molAcidBriscese and Riveros, 1975gas phase; HO- + C6F6 -> , acidity probably ca. 320 kcal
Quantity Value Units Method Reference Comment
Δr320.8 ± 2.0kcal/molIMREKoppel, Taft, et al., 1994gas phase

References

Koppel, Taft, et al., 1994
Koppel, I.A.; Taft, R.W.; Anvia, F.; Zhu, S.Z.; Hu, L.Q.; Sung, K.S.; Desmarteau, D.D.; Yagupolskii, L.M., The Gas-Phase Acidities of Very Strong Neutral Bronsted Acids, J. Am. Chem. Soc., 1994, 116, 7, 3047, https://doi.org/10.1021/ja00086a038 . [all data]

Briscese and Riveros, 1975
Briscese, S.M.J.; Riveros, J.M., Gas phase nucleophilic reactions of aromatic systems, J. Am. Chem. Soc., 1975, 97, 230. [all data]