(NaCl)11 radical anion

Gas phase ion energetics data

Data compiled by: John E. Bartmess

Electron affinity of neutral species

EAneutral (eV) Method Reference Comment
2.100 ± 0.050LPESXia, Yu, et al., 1993Stated electron affinity is the Vertical Detachment Energy

References

Xia, Yu, et al., 1993
Xia, P.; Yu, N.C.; Bloomfield, L.A., Experimental and Theoretical Studies of Single Excess Electrons in Sodium Chloride Cluster Anions, Phys. Rev. B: Cond. Matt., 1993, 47, 15, 10040, https://doi.org/10.1103/PhysRevB.47.10040 . [all data]