(benzene)2..NO radical anion

Reaction thermochemistry data

Data compiled by: John E. Bartmess

Individual Reactions

C6H6NO- + 2Benzene = C12H12NO-

By formula: C6H6NO- + 2C6H6 = C12H12NO-

Quantity Value Units Method Reference Comment
Δr73.2 ± 9.6kJ/molN/ALe Barbu, Schiedt, et al., 2002gas phase; Affinity is difference in EAs of lesser solvated species

Gas phase ion energetics data

Data compiled by: John E. Bartmess

Electron affinity of neutral species

EAneutral (eV) Method Reference Comment
0.79 ± 0.10LPESLe Barbu, Schiedt, et al., 2002Affinity is difference in EAs of lesser solvated species

Ion clustering data

Data compiled by: John E. Bartmess

Clustering reactions

C6H6NO- + 2Benzene = C12H12NO-

By formula: C6H6NO- + 2C6H6 = C12H12NO-

Quantity Value Units Method Reference Comment
Δr73.2 ± 9.6kJ/molN/ALe Barbu, Schiedt, et al., 2002gas phase; Affinity is difference in EAs of lesser solvated species

References

Le Barbu, Schiedt, et al., 2002
Le Barbu, K.; Schiedt, J.; Weinkauf, R.; Schlag, E.W.; Nilles, J.M.; Xu, S.J.; Thomas, O.C.; Bowen, K.H., Microsolvation of small anions by aromatic molecules: An exploratory study, J. Chem. Phys., 2002, 116, 22, 9663-9671, https://doi.org/10.1063/1.1475750 . [all data]