(benzene)2..Co3 anion

Gas phase ion energetics data

Data compiled by: John E. Bartmess

Electron affinity of neutral species

EAneutral (eV) Method Reference Comment
0.68 ± 0.10LPESGerhards, Thomas, et al., 2002

References

Gerhards, Thomas, et al., 2002
Gerhards, M.; Thomas, O.C.; Nilles, J.M.; Zheng, W.J.; Bowen, K.H., Cobalt-benzene cluster anions: Mass spectrometry and negative ion photoelectron spectroscopy, J. Chem. Phys., 2002, 116, 23, 10247-10252, https://doi.org/10.1063/1.1477924 . [all data]