2-naphthoxide anion

Gas phase ion energetics data

Data compiled by: John E. Bartmess

Protonation reactions

C10H7O- + Hydrogen cation = 2-Naphthalenol

By formula: C10H7O- + H+ = C10H8O

Quantity Value Units Method Reference Comment
Δr343.8 ± 2.1kcal/molG+TSTaft, 1987gas phase; value altered from reference due to change in acidity scale
Quantity Value Units Method Reference Comment
Δr336.5 ± 2.0kcal/molIMRETaft, 1987gas phase; value altered from reference due to change in acidity scale

References

Taft, 1987
Taft, R.W., The Nature and Analysis of Substitutent Electronic Effects, Personal communication. See also Prog. Phys. Org. Chem., 1987, 16, 1. [all data]