NaO5 anion

Gas phase ion energetics data

Data compiled by: John E. Bartmess

Electron affinity of neutral species

EAneutral (eV) Method Reference Comment
3.20 ± 0.20LPESZhai, Yang, et al., 2002Vertical Detachment Energy: 3.53±0.08 eV

References

Zhai, Yang, et al., 2002
Zhai, H.J.; Yang, X.; Wang, X.B.; Wang, L.S.; Elliott, B.; Boldyrev, A.I., In search of covalently bound tetra- and penta-oxygen species: A photoelectron spectroscopic and ab initio investigation of MO4- and MO5- (M = Li, Na, K, Cs), J. Am. Chem. Soc., 2002, 124, 23, 6742-6750, https://doi.org/10.1021/ja020097k . [all data]