CD3OH..CD3O anion

Ion clustering data

Data compiled by: John E. Bartmess

Clustering reactions

CD3O- + Methanol-D4 = C2HD7O2-

By formula: CD3O- + CD4O = C2HD7O2-

Quantity Value Units Method Reference Comment
Δr118. ± 4.2kJ/molIMREChabinyc and Brauman, 2000gas phase; Original dG=18.8 at 350K; dS based of symmetry alone
Quantity Value Units Method Reference Comment
Δr84.5 ± 4.2kJ/molIMREChabinyc and Brauman, 2000gas phase; Original dG=18.8 at 350K; dS based of symmetry alone

References

Chabinyc and Brauman, 2000
Chabinyc, M.L.; Brauman, J.I., Unusual ionic hydrogen bonds: Complexes of acetylides and fluoroform, J. Am. Chem. Soc., 2000, 122, 36, 8739-8745, https://doi.org/10.1021/ja000806z . [all data]