Er6Cl19 anion

Reaction thermochemistry data

Data compiled by: John E. Bartmess

Individual Reactions

Cl10Er3- + Cl3Er = Cl19Er6-

By formula: Cl10Er3- + Cl3Er = Cl19Er6-

Quantity Value Units Method Reference Comment
Δr390. ± 63.kJ/molTDAsPogrebnoi, Motalov, et al., 2002gas phase; Affinity taken as Er3Cl9..Er3Cl10-; value altered from reference due to change in acidity scale

Ion clustering data

Data compiled by: John E. Bartmess

Clustering reactions

Cl10Er3- + Cl3Er = Cl19Er6-

By formula: Cl10Er3- + Cl3Er = Cl19Er6-

Quantity Value Units Method Reference Comment
Δr390. ± 63.kJ/molTDAsPogrebnoi, Motalov, et al., 2002gas phase; Affinity taken as Er3Cl9..Er3Cl10-; value altered from reference due to change in acidity scale

References

Pogrebnoi, Motalov, et al., 2002
Pogrebnoi, A.M.; Motalov, V.B.; Kuznetsov, A.Y.; Kudin, L.S.; Khasanshin, I.V., Molecular and ionic associates in the saturated vapor over erbium trichloride and the ErCl3-DyCl3 system, Russ. J. Inorg. Chem., 2002, 47, 96-100. [all data]