Er3Cl10 anion

Ion clustering data

Data compiled by: John E. Bartmess

Clustering reactions

Chlorine anion + Cl3Er = Cl10Er3-

By formula: Cl- + Cl3Er = Cl10Er3-

Quantity Value Units Method Reference Comment
Δr330. ± 59.kJ/molTDAsPogrebnoi, Motalov, et al., 2002gas phase; value altered from reference due to change in acidity scale

Cl10Er3- + Cl3Er = Cl19Er6-

By formula: Cl10Er3- + Cl3Er = Cl19Er6-

Quantity Value Units Method Reference Comment
Δr390. ± 63.kJ/molTDAsPogrebnoi, Motalov, et al., 2002gas phase; Affinity taken as Er3Cl9..Er3Cl10-; value altered from reference due to change in acidity scale

Gas phase thermochemistry data

Data compiled by: John E. Bartmess

Quantity Value Units Method Reference Comment
Δfgas-747.9 ± 9.6kcal/molTherPogrebnoi, Motalov, et al., 2002value altered from reference due to change in acidity scale

Reaction thermochemistry data

Data compiled by: John E. Bartmess

Individual Reactions

Cl10Er3- + Cl3Er = Cl19Er6-

By formula: Cl10Er3- + Cl3Er = Cl19Er6-

Quantity Value Units Method Reference Comment
Δr93. ± 15.kcal/molTDAsPogrebnoi, Motalov, et al., 2002gas phase; Affinity taken as Er3Cl9..Er3Cl10-; value altered from reference due to change in acidity scale

Chlorine anion + Cl3Er = Cl10Er3-

By formula: Cl- + Cl3Er = Cl10Er3-

Quantity Value Units Method Reference Comment
Δr80. ± 14.kcal/molTDAsPogrebnoi, Motalov, et al., 2002gas phase; value altered from reference due to change in acidity scale

References

Pogrebnoi, Motalov, et al., 2002
Pogrebnoi, A.M.; Motalov, V.B.; Kuznetsov, A.Y.; Kudin, L.S.; Khasanshin, I.V., Molecular and ionic associates in the saturated vapor over erbium trichloride and the ErCl3-DyCl3 system, Russ. J. Inorg. Chem., 2002, 47, 96-100. [all data]