BiCl3..Cl anion

Gas phase thermochemistry data

Data compiled by: John E. Bartmess

Quantity Value Units Method Reference Comment
Δfgas-646.14kJ/molTherWalker, Check, et al., 2002

Reaction thermochemistry data

Data compiled by: John E. Bartmess

Individual Reactions

Chlorine anion + BiCl3 = BiCl4-

By formula: Cl- + BiCl3 = BiCl4-

Quantity Value Units Method Reference Comment
Δr153. ± 15.kJ/molCIDTWalker, Check, et al., 2002gas phase

Ion clustering data

Data compiled by: John E. Bartmess

Clustering reactions

Chlorine anion + BiCl3 = BiCl4-

By formula: Cl- + BiCl3 = BiCl4-

Quantity Value Units Method Reference Comment
Δr153. ± 15.kJ/molCIDTWalker, Check, et al., 2002gas phase

References

Walker, Check, et al., 2002
Walker, B.W.; Check, C.E.; Lobring, K.C.; Pommerening, C.A.; Sunderlin, L.S., The Thermochemistry of Group 15 Tetrachloride Anions, J. Am. Soc. Mass Spectrom., 2002, 13, 5, 469, https://doi.org/10.1016/S1044-0305(02)00369-0 . [all data]