(NH3)3..I anion

Gas phase ion energetics data

Data compiled by: John E. Bartmess

Electron affinity of neutral species

EAneutral (eV) Method Reference Comment
3.77 ± 0.25LPESFrischkorn, Zanni, et al., 2000EA=Vertical Detachment Energy. Femtosecond Time resolved LPES.

References

Frischkorn, Zanni, et al., 2000
Frischkorn, C.; Zanni, M.T.; Davis, A.V.; Neumark, D.M., Electron solvation dynamics in I-(NH3)(n) clusters, Faraday Disc. Chem. Soc., 2000, 115, 49-62, https://doi.org/10.1039/a909865h . [all data]