mCOMe-phenoxide anion

Gas phase ion energetics data

Data compiled by: John E. Bartmess

Electron affinity of neutral species

EAneutral (eV) Method Reference Comment
2.65 ± 0.10D-EAFujio, McIver, et al., 1981value altered from reference due to change in acidity scale

Protonation reactions

C8H7O2- + Hydrogen cation = Ethanone, 1-(3-hydroxyphenyl)-

By formula: C8H7O2- + H+ = C8H8O2

Quantity Value Units Method Reference Comment
Δr1433. ± 8.8kJ/molG+TSFujio, McIver, et al., 1981gas phase; value altered from reference due to change in acidity scale
Quantity Value Units Method Reference Comment
Δr1404. ± 8.4kJ/molIMREFujio, McIver, et al., 1981gas phase; value altered from reference due to change in acidity scale

Reaction thermochemistry data

Data compiled by: John E. Bartmess

Individual Reactions

C8H7O2- + Hydrogen cation = Ethanone, 1-(3-hydroxyphenyl)-

By formula: C8H7O2- + H+ = C8H8O2

Quantity Value Units Method Reference Comment
Δr342.5 ± 2.1kcal/molG+TSFujio, McIver, et al., 1981gas phase; value altered from reference due to change in acidity scale
Quantity Value Units Method Reference Comment
Δr335.6 ± 2.0kcal/molIMREFujio, McIver, et al., 1981gas phase; value altered from reference due to change in acidity scale

References

Fujio, McIver, et al., 1981
Fujio, M.; McIver, R.T., Jr.; Taft, R.W., Effects on the acidities of phenols from specific substituent-solvent interactions. Inherent substituent parameters from gas phase acidities, J. Am. Chem. Soc., 1981, 103, 4017. [all data]