(Ar)3..NO anion

Reaction thermochemistry data

Data compiled by: John E. Bartmess

Individual Reactions

Ar2NO- + 3Argon = Ar3NO-

By formula: Ar2NO- + 3Ar = Ar3NO-

Quantity Value Units Method Reference Comment
Δr5.44kJ/molN/AHendricks, de Clercq, et al., 2002gas phase

Ar3NO- + 4Argon = Ar4NO-

By formula: Ar3NO- + 4Ar = Ar4NO-

Quantity Value Units Method Reference Comment
Δr5.44kJ/molN/AHendricks, de Clercq, et al., 2002gas phase

References

Hendricks, de Clercq, et al., 2002
Hendricks, J.H.; de Clercq, H.L.; Freidhoff, C.B.; Arnold, S.T.; Eaton, J.G.; Fancher, C.; Lyapustina, S.A.; S., Anion solvation at the microscopic level: Photoelectron spectroscopy of the solvated anion clusters, NO-(Y)(n), where Y=Ar, Kr, Xe, N2O, H2S, NH3, H2O, and C2H4(OH)(2), J. Chem. Phys., 2002, 116, 18, 7926-7938, https://doi.org/10.1063/1.1457444 . [all data]