Pr anion

Gas phase ion energetics data

Data compiled by: John E. Bartmess

Electron affinity of neutral species

EAneutral (eV) Method Reference Comment
0.962 ± 0.024LPESDavis and Thompson, 2002

References

Davis and Thompson, 2002
Davis, V.T.; Thompson, J.S., Measurement of the electron affinity of praseodymium, J. Phys. B: Atom. Mol. Opt. Phys., 2002, 35, 1, L11-L14, https://doi.org/10.1088/0953-4075/35/1/102 . [all data]