Sc2ErN@C80 radical anion

Gas phase ion energetics data

Data compiled by: John E. Bartmess

Electron affinity of neutral species

EAneutral (eV) Method Reference Comment
2.760 ± 0.050TDEqIoffe, Ievlev, et al., 2002

References

Ioffe, Ievlev, et al., 2002
Ioffe, I.N.; Ievlev, A.S.; Boltalina, O.V.; Sidorov, L.N.; Dorn, H.C.; Stevenson, S.; Rice, G., Electron affinity of some trimetallic nitride and conventional metallofullerenes, Int. J. Mass Spectrom., 2002, 213, 2-3, 183-189, https://doi.org/10.1016/S1387-3806(01)00532-2 . [all data]